{"text_format":"1","workbook":"xlsx","n_sheets":3,"sheets":["Stave Summary","Definitions","Calculations"],"not_rendered":{"charts":1,"images":7,"macros":1,"external_links":0,"defined_names":29,"comments":0,"pivot_tables":0},"unopened":[],"bounds":{"document_bytes":16777216,"sheet_cells":100000,"rows_first":2000,"rows_last":500,"rows_between":2000,"halvings":0,"cell_chars":16384,"cell_head_chars":4096},"cells_cut":0,"cells_raw":0,"read":"whole","date_system":"1900"}

{"sheet":"Stave Summary","index":0,"n_rows":20,"n_cols":15,"rows_kept":20,"cut":false,"hidden":false,"merged":[]}
[null,null,null,null,null,null,null,"Stave Designer"]
[]
[null,"Parameters",null,null,"Measurements",null,null,null,null,"\"+Kerf\"",null,null,null,null,0]
[null,"Material Thickness",0.25,null,"End #1 Stave Width",{"$f":"Calculations!C7-Glue*Number_of_Sides","v":1.4918427553474352},null,"Total Stave Width",{"$f":"F4*Number_of_Sides","v":23.869484085558963},{"$f":"I4+Number_of_Sides*C10","v":25.869484085558963}]
[null,"Number of Sides",16,null,"Stave edge Angle",{"$f":"Calculations!F28","v":11.081503208212533},null,"Tablesaw Angle",{"$f":"90-F5","v":78.918496791787462}]
[null,"ID End1 ",7,null,"End1 Circumfrence",{"$f":"ROUND(Calculations!C6,2)","v":24.02}]
[null,"ID End2 ",11,null,"Stave Length",{"$f":"SQRT(POWER((Inside_diameter_1/2)-(Inside_diameter_2/2),2)+POWER(Unit_Height,2))","v":11.672617529928752},null,"Unit Slope",{"$f":"Calculations!$C$11-0.001","v":9.8650000000000002}]
[null,"Unit Height",11.5]
[null,"Glue Thickness",0,null,"End #2 Stave Width",{"$f":"IF(ISNUMBER(C7),Calculations!F7,0)-Glue*Number_of_Sides","v":2.287492224866067},null,"Total Stave Width",{"$f":"F9*Number_of_Sides","v":36.599875597857071}]
[null,"Saw Blade Kerf",0.125,null,"End2 Circumfrence",{"$f":"IF(ISNUMBER(C7),ROUND(Calculations!F6,2))","v":36.840000000000003}]
[null,null,null,null,"Miter Guage Angle",{"$f":"Calculations!F26","v":88.047969963846839}]
[]
[]
[null,null,null,null,"Settings for Cut Jig"]
[null,null,null,null,"Offset",{"$f":"Material_Thickness*TAN(RADIANS(Stave_edge_Angle))","v":4.8964241266650388E-2},null,"Overage"]
[null,null,null,null,"Cut #1  End #1",{"$f":"F4-F15+F17+H16","v":3.4085817629208854},null,6.25E-2]
[null,null,null,null,"              End #2",{"$f":"((F4-F9)/2)+F9-F15+H16","v":1.9032032488401005}]
[null,null,null,null,null,null,null,"Stave blank size"]
[null,null,null,null," cut #2   End #2",{"$f":"F9-F15","v":2.2385279835994165},null,{"$f":"(ROUND(Stave_Length,2)&\" X \"&(ROUND(F4+H16,2)))","v":"11.67 X 1.55"}]
[null,null,null,null,"              End #1",{"$f":"F4-F15","v":1.4428785140807847}]

{"sheet":"Definitions","index":1,"n_rows":57,"n_cols":2,"rows_kept":57,"cut":false,"hidden":false,"merged":[]}
[]
[]
[]
[]
[]
[]
[]
[]
[]
[]
[]
[]
[]
[]
[]
[]
[]
[]
[]
[]
[]
[]
[]
[]
[]
[]
[]
[]
[]
[]
[]
[]
[]
[]
[]
[]
[]
[]
[]
[]
[]
[]
[]
[]
[]
[]
[]
[]
[]
[]
[]
[]
[]
[]
[]
[]
[null,"end"]

{"sheet":"Calculations","index":2,"n_rows":53,"n_cols":27,"rows_kept":53,"cut":false,"hidden":false,"merged":[]}
[]
[null,"Calculations Stave End 1",null,null,"Calculations Stave End 2",null,null,"End 1 Polygon Values-1",null,null,"End1 Circle Values",null,null,"End 1 Polygon Values-2 ",null,null,"End1 Joint Values",null,null,"End 2 Polygon Values",null,null,"End2 Circle_Values",null,null,"End2 Joint Values"]
[null,null,null,null,null,null,null,"From Macro",null,null,"From Macro",null,null,"From Macro",null,null,"From Macro",null,null,"From Macro",null,null,"From Macro",null,null,"From Macro"]
[null,"Outside Diameter",{"$f":"Inside_diameter_1+(2*Material_Thickness)","v":7.5},null,"Outside Diameter",{"$f":"Inside_diameter_2+(2*Material_Thickness)","v":11.5},null,3.823466843281194,0,null,3.5,0,null,3.5685690537291141,0,null,3.823466843281194,0,null,5.6077513701457509,0,null,5.5,0,null,5.6077513701457509,0]
[null,"Outside Diameter + Apothem",{"$f":"C4/COS(RADIANS(180/Number_of_Sides))","v":7.646933686562388},null,"Outside Diameter + Apothem",{"$f":"F4/COS(RADIANS(180/Number_of_Sides))","v":11.725298319395661},null,3.5324227597430347,1.4631774151209622,null,3.4235166025683199,0.72769091786215756,null,3.2969279090934989,1.3656322541128978,null,3.5685690537291141,0,null,5.1808867142897839,2.1459935421774112,null,5.3798118040359313,1.1435142994976761,null,3.823466843281194,0]
[null,"Outside Circumfrence",{"$f":"PI()*C5","v":24.02355069219271},null,"Outside Circumfrence",{"$f":"PI()*F5","v":36.836111061362153},null,2.7035993325260552,2.7035993325260548,null,3.1974091017491029,1.4235782507653005,null,2.5233593770243177,2.5233593770243172,null,null,null,null,3.9652790210382136,3.9652790210382132,null,5.0245000170343044,2.2370515369169008]
[null,"Side Width",{"$f":"SIN(RADIANS(360/Number_of_Sides))*((C5/2)/SIN(RADIANS((90-(360/Number_of_Sides)/2))))","v":1.4918427553474352},null,"Side Width",{"$f":"SIN(RADIANS(360/'Stave Summary'!C5))*((F5/2)/SIN(RADIANS((90-(360/'Stave Summary'!C5)/2))))","v":2.287492224866067},null,1.4631774151209624,3.5324227597430347,null,2.8315594803123161,2.0572483830236559,null,1.365632254112898,3.2969279090934989,null,3.5324227597430347,1.4631774151209622,null,2.1459935421774112,5.1808867142897839,null,4.4495934690622114,3.2328188876086021,null,5.1808867142897839,2.1459935421774112]
[null,"Inside Diameter + Apothem",{"$f":"Inside_diameter_1/COS(RADIANS(180/Number_of_Sides))","v":7.1371381074582283},null,null,null,null,2.3411982156351746E-16,3.823466843281194,null,2.3419571222560038,2.6010068891708795,null,2.1851183345928293E-16,3.5685690537291141,null,3.2969279090934989,1.3656322541128978,null,3.4337573829315891E-16,5.6077513701457509,null,3.6802183349737203,4.087296540125668,null,3.5324227597430347,1.4631774151209622]
[null,null,null,null,"End2 Diameter+ Apothem",{"$f":"Inside_diameter_2/COS(RADIANS(180/Number_of_Sides))","v":11.215502740291502},null,-1.463177415120962,3.5324227597430347,null,1.7500000000000004,3.0310889132455352,null,-1.3656322541128978,3.2969279090934989,null,null,null,null,-2.1459935421774108,5.1808867142897839,null,2.7500000000000004,4.7631397208144124]
[null,null,null,null,null,null,null,-2.7035993325260548,2.7035993325260552,null,1.0815594803123161,3.3286978070330373,null,-2.5233593770243172,2.5233593770243177,null,2.7035993325260552,2.7035993325260548,null,-3.9652790210382132,3.9652790210382136,null,1.699593469062211,5.2308108396233441,null,3.9652790210382136,3.9652790210382132]
[null,"Calculated Inverted Slope",{"$f":"IF(Inside_diameter_1=Inside_diameter_2,0.001,IF(Inside_diameter_1>Inside_diameter_2,ROUND(90-DEGREES(ATAN(Unit_Height/((Inside_diameter_1/2)-(Inside_diameter_2/2)))),3),ROUND(90-DEGREES(ATAN(Unit_Height/((Inside_diameter_2/2)-(Inside_diameter_1/2)))),3)))","v":9.8659999999999997},null,null,null,null,-3.5324227597430347,1.4631774151209627,null,0.36584962143678712,3.4808266337889564,null,-3.2969279090934989,1.3656322541128982,null,2.5233593770243177,2.5233593770243172,null,-5.1808867142897839,2.1459935421774117,null,0.57490654797209406,5.469870424525503,null,2.7035993325260552,2.7035993325260548]
[null,null,null,null,null,null,null,-3.823466843281194,4.6823964312703492E-16,null,-0.36584962143678668,3.4808266337889568,null,-3.5685690537291141,4.3702366691856586E-16,null,null,null,null,-5.6077513701457509,6.8675147658631783E-16,null,-0.57490654797209328,5.4698704245255039]
[null,null,null,null,null,null,null,-3.5324227597430351,-1.4631774151209616,null,-1.0815594803123156,3.3286978070330377,null,-3.2969279090934993,-1.3656322541128973,null,1.4631774151209624,3.5324227597430347,null,-5.1808867142897848,-2.1459935421774099,null,-1.6995934690622103,5.230810839623345,null,2.1459935421774112,5.1808867142897839]
[null,null,null,null,null,null,null,-2.7035993325260557,-2.7035993325260548,null,-1.7499999999999991,3.0310889132455356,null,-2.5233593770243181,-2.5233593770243172,null,1.365632254112898,3.2969279090934989,null,-3.9652790210382145,-3.9652790210382132,null,-2.7499999999999987,4.7631397208144133,null,1.4631774151209624,3.5324227597430347]
[null,null,null,null,null,null,null,-1.4631774151209642,-3.5324227597430338,null,-2.3419571222560038,2.60100688917088,null,-1.3656322541128998,-3.296927909093498,null,null,null,null,-2.1459935421774143,-5.180886714289783,null,-3.6802183349737203,4.087296540125668]
[null,null,null,null,null,null,null,-7.0235946469055229E-16,-3.823466843281194,null,-2.8315594803123156,2.0572483830236563,null,-6.5553550037784881E-16,-3.5685690537291141,null,2.3411982156351746E-16,3.823466843281194,null,-1.0301272148794766E-15,-5.6077513701457509,null,-4.4495934690622105,3.232818887608603,null,3.4337573829315891E-16,5.6077513701457509]
[null,null,null,null,null,null,null,1.4631774151209629,-3.5324227597430342,null,-3.1974091017491029,1.4235782507653014,null,1.3656322541128987,-3.2969279090934984,null,2.1851183345928293E-16,3.5685690537291141,null,2.1459935421774121,-5.180886714289783,null,-5.0245000170343044,2.2370515369169022,null,2.3411982156351746E-16,3.823466843281194]
[null,null,null,null,null,null,null,2.7035993325260543,-2.7035993325260557,null,-3.4235166025683199,0.72769091786215756,null,2.5233593770243172,-2.5233593770243181,null,null,null,null,3.9652790210382127,-3.9652790210382145,null,-5.3798118040359313,1.1435142994976761]
[null,null,null,null,null,null,null,3.5324227597430338,-1.4631774151209644,null,-3.5,4.2862637970157361E-16,null,3.296927909093498,-1.3656322541129,null,-1.463177415120962,3.5324227597430347,null,5.180886714289783,-2.1459935421774143,null,-5.5,6.735557395310443E-16,null,-2.1459935421774108,5.1808867142897839]
[null,null,null,null,null,null,null,3.823466843281194,-9.3647928625406985E-16,null,-3.4235166025683199,-0.72769091786215667,null,3.5685690537291141,-8.7404733383713172E-16,null,-1.3656322541128978,3.2969279090934989,null,5.6077513701457509,-1.3735029531726357E-15,null,-5.3798118040359313,-1.1435142994976748,null,-1.463177415120962,3.5324227597430347]
[null,null,null,null,null,null,null,null,null,null,-3.1974091017491029,-1.4235782507653008,null,null,null,null,null,null,null,null,null,null,-5.0245000170343044,-2.2370515369169013]
[null,null,null,null,"Miter Calculations",null,null,null,null,null,-2.8315594803123161,-2.0572483830236554,null,null,null,null,-2.7035993325260548,2.7035993325260552,null,null,null,null,-4.4495934690622114,-3.2328188876086017,null,-3.9652790210382132,3.9652790210382136]
[null,null,null,null,null,null,null,null,null,null,-2.3419571222560047,-2.6010068891708791,null,null,null,null,-2.5233593770243172,2.5233593770243177,null,null,null,null,-3.6802183349737216,-4.0872965401256671,null,-2.7035993325260548,2.7035993325260552]
[null,null,null,null,"Slope Angle",{"$f":"90-C11","v":80.134},null,null,null,null,-1.7500000000000016,-3.0310889132455343,null,null,null,null,null,null,null,null,null,null,-2.7500000000000027,-4.7631397208144115]
[null,null,null,null," SlopeTangent",{"$f":"1/(COS(RADIANS(F24))*TAN(RADIANS(360/(2*Number_of_Sides))))","v":29.340537084181882},null,null,null,null,-1.0815594803123165,-3.3286978070330373,null,null,null,null,-3.5324227597430347,1.4631774151209627,null,null,null,null,-1.6995934690622116,-5.2308108396233441,null,-5.1808867142897839,2.1459935421774117]
[null,null,null,null," Slope Angle",{"$f":"DEGREES(ATAN(F25))","v":88.047969963846839},null,null,null,null,-0.36584962143678679,-3.4808266337889568,null,null,null,null,-3.2969279090934989,1.3656322541128982,null,null,null,null,-0.57490654797209351,-5.4698704245255039,null,-3.5324227597430347,1.4631774151209627]
[null,null,null,null," Saw Blade Tangent",{"$f":"COS(RADIANS(F26))*TAN(RADIANS(F24))","v":0.1958569650666015},null,null,null,null,0.36584962143678545,-3.4808266337889568,null,null,null,null,null,null,null,null,null,null,0.5749065479720914,-5.4698704245255039]
[null,null,null,null,"Saw Blade Angle",{"$f":"DEGREES(ATAN(F27))","v":11.081503208212533},null,null,null,null,1.0815594803123152,-3.3286978070330377,null,null,null,null,-3.823466843281194,4.6823964312703492E-16,null,null,null,null,1.6995934690622096,-5.230810839623345,null,-5.6077513701457509,6.8675147658631783E-16]
[null,null,null,null,null,null,null,null,null,null,1.7500000000000004,-3.0310889132455352,null,null,null,null,-3.5685690537291141,4.3702366691856586E-16,null,null,null,null,2.7500000000000004,-4.7631397208144124,null,-3.823466843281194,4.6823964312703492E-16]
[null,null,null,null,null,null,null,null,null,null,2.3419571222560025,-2.6010068891708809,null,null,null,null,null,null,null,null,null,null,3.6802183349737181,-4.0872965401256698]
[null,null,null,null,null,null,null,null,null,null,2.8315594803123156,-2.0572483830236568,null,null,null,null,-3.5324227597430351,-1.4631774151209616,null,null,null,null,4.4495934690622105,-3.2328188876086035,null,-5.1808867142897848,-2.1459935421774099]
[null,null,null,null,null,null,null,null,null,null,3.1974091017491033,-1.4235782507653005,null,null,null,null,-3.2969279090934993,-1.3656322541128973,null,null,null,null,5.0245000170343053,-2.2370515369169008,null,-3.5324227597430351,-1.4631774151209616]
[null,null,null,null,null,null,null,null,null,null,3.4235166025683195,-0.72769091786215956,null,null,null,null,null,null,null,null,null,null,5.3798118040359304,-1.1435142994976792]
[null,null,null,null,null,null,null,null,null,null,3.5,-8.5725275940314722E-16,null,null,null,null,-2.7035993325260557,-2.7035993325260548,null,null,null,null,5.5,-1.3471114790620886E-15,null,-3.9652790210382145,-3.9652790210382132]
[null,null,null,null,null,null,null,null,null,null,null,null,null,null,null,null,-2.5233593770243181,-2.5233593770243172,null,null,null,null,null,null,null,-2.7035993325260557,-2.7035993325260548]
[]
[null,null,null,null,null,null,null,null,null,null,null,null,null,null,null,null,-1.4631774151209642,-3.5324227597430338,null,null,null,null,null,null,null,-2.1459935421774143,-5.180886714289783]
[null,null,null,null,null,null,null,null,null,null,null,null,null,null,null,null,-1.3656322541128998,-3.296927909093498,null,null,null,null,null,null,null,-1.4631774151209642,-3.5324227597430338]
[]
[null,null,null,null,null,null,null,null,null,null,null,null,null,null,null,null,-7.0235946469055229E-16,-3.823466843281194,null,null,null,null,null,null,null,-1.0301272148794766E-15,-5.6077513701457509]
[null,null,null,null,null,null,null,null,null,null,null,null,null,null,null,null,-6.5553550037784881E-16,-3.5685690537291141,null,null,null,null,null,null,null,-7.0235946469055229E-16,-3.823466843281194]
[]
[null,null,null,null,null,null,null,null,null,null,null,null,null,null,null,null,1.4631774151209629,-3.5324227597430342,null,null,null,null,null,null,null,2.1459935421774121,-5.180886714289783]
[null,null,null,null,null,null,null,null,null,null,null,null,null,null,null,null,1.3656322541128987,-3.2969279090934984,null,null,null,null,null,null,null,1.4631774151209629,-3.5324227597430342]
[]
[null,null,null,null,null,null,null,null,null,null,null,null,null,null,null,null,2.7035993325260543,-2.7035993325260557,null,null,null,null,null,null,null,3.9652790210382127,-3.9652790210382145]
[null,null,null,null,null,null,null,null,null,null,null,null,null,null,null,null,2.5233593770243172,-2.5233593770243181,null,null,null,null,null,null,null,2.7035993325260543,-2.7035993325260557]
[]
[null,null,null,null,null,null,null,null,null,null,null,null,null,null,null,null,3.5324227597430338,-1.4631774151209644,null,null,null,null,null,null,null,5.180886714289783,-2.1459935421774143]
[null,null,null,null,null,null,null,null,null,null,null,null,null,null,null,null,3.296927909093498,-1.3656322541129,null,null,null,null,null,null,null,3.5324227597430338,-1.4631774151209644]
[]
[null,null,null,null,null,null,null,null,null,null,null,null,null,null,null,null,3.823466843281194,-9.3647928625406985E-16,null,null,null,null,null,null,null,5.6077513701457509,-1.3735029531726357E-15]
[null,null,null,null,null,null,null,null,null,null,null,null,null,null,null,null,3.5685690537291141,-8.7404733383713172E-16,null,null,null,null,null,null,null,3.823466843281194,-9.3647928625406985E-16]